This instance will be upgraded to Heptapod 0.27.1 on 2021-12-02 at 15:00 UTC+1 (a few minutes of down time)

Heptapod CI: removed unnecessary install steps in "inside" tests

These are now provided by the dedicated image with chromium.
We keep only the sudoers configuration (allowing the user running the tests
to call `gitlab-ctl` and friends).
14 jobs for !68 with topic/default/prebuilt-images in 58 minutes and 30 seconds (queued for 1 second)
latest detached
Status Name Job ID Coverage
  Lint
passed flake8 #127067

00:00:29

 
  Test Heptapod
passed docker-inside #127068

00:34:59

passed docker-native-inside #127071

00:17:56

failed docker-native-remote-0 #127080

00:23:00

failed docker-native-remote-1 #127081

00:21:32

failed docker-remote-0 #127082

00:21:58

failed docker-remote-1 #127079

00:22:54

canceled docker-native-remote-0 #127074

00:22:46

failed docker-native-remote-0 #127072

00:27:18

failed docker-native-remote-1 #127073

00:21:24

canceled docker-native-remote-1 #127075

00:22:43

failed docker-remote-0 #127076

00:16:58

failed docker-remote-0 #127069

00:27:17

failed docker-remote-1 #127070

00:33:31

 
Name Stage Failure
failed
docker-remote-0 Test Heptapod
FAILED tests/test_ssh.py::test_permissions - AssertionError: assert ('could n...
FAILED tests/test_wikis.py::test_wiki_basic - subprocess.CalledProcessError: ...
=========== 10 failed, 7 deselected, 1 warning in 133.18s (0:02:13) ============
ERROR: InvocationError for command '/builds/heptapod/heptapod-tests/.tox/py3/bin/py.test --lf -v --num-shards=2 --shard-id=0 --heptapod-url http://172.17.0.3 --heptapod-ssh-port 22 --heptapod-remote --heptapod-webdriver-remote-url http://selenium-0:4444/wd/hub' (exited with code 1)
___________________________________ summary ____________________________________
ERROR: py3: commands failed
Running after_script
Uploading artifacts for failed job
ERROR: Job failed: exit code 1
failed
docker-native-remote-1 Test Heptapod
ERROR tests/test_topics.py::test_stacked_topic_amend_first - AssertionError: ...
ERROR tests/test_topics.py::test_default_branch_not_topic_push_twice - Assert...
=========== 1 deselected, 1 warning, 47 errors in 601.53s (0:10:01) ============
ERROR: InvocationError for command '/builds/heptapod/heptapod-tests/.tox/py3/bin/py.test --lf -v --num-shards=2 --shard-id=1 --heptapod-url http:// --heptapod-ssh-port 22 --heptapod-remote --heptapod-webdriver-remote-url http://selenium-native-1:4444/wd/hub --heptapod-hg-native' (exited with code 1)
___________________________________ summary ____________________________________
ERROR: py3: commands failed
Running after_script
Uploading artifacts for failed job
ERROR: Job failed: exit code 1
failed
docker-native-remote-0 Test Heptapod
FAILED tests/test_ssh.py::test_permissions - AssertionError: assert ('could n...
FAILED tests/test_wikis.py::test_wiki_basic - subprocess.CalledProcessError: ...
=========== 10 failed, 7 deselected, 1 warning in 134.34s (0:02:14) ============
ERROR: InvocationError for command '/builds/heptapod/heptapod-tests/.tox/py3/bin/py.test --lf -v --num-shards=2 --shard-id=0 --heptapod-url http://172.17.0.5 --heptapod-ssh-port 22 --heptapod-remote --heptapod-webdriver-remote-url http://selenium-native-0:4444/wd/hub --heptapod-hg-native' (exited with code 1)
___________________________________ summary ____________________________________
ERROR: py3: commands failed
Running after_script
Uploading artifacts for failed job
ERROR: Job failed: exit code 1
failed
docker-remote-1 Test Heptapod
FAILED tests/test_push.py::test_protected_branch_refusal - AssertionError: as...
FAILED tests/test_ssh.py::test_owner_push_pull - subprocess.CalledProcessErro...
======= 6 failed, 1 passed, 3 deselected, 1 warning in 219.72s (0:03:39) =======
ERROR: InvocationError for command '/builds/heptapod/heptapod-tests/.tox/py3/bin/py.test --lf -v --num-shards=2 --shard-id=1 --heptapod-url http://172.17.0.4 --heptapod-ssh-port 22 --heptapod-remote --heptapod-webdriver-remote-url http://selenium-1:4444/wd/hub' (exited with code 1)
___________________________________ summary ____________________________________
ERROR: py3: commands failed
Running after_script
Uploading artifacts for failed job
ERROR: Job failed: exit code 1