This instance will be upgraded to Heptapod 0.21.0rc2 on 2021-04-16 at 14:00 UTC+2 (a few minutes of down time)

Commit: return with logging if revision not found

4 jobs for topic/default/find-commits in 1 minute and 9 seconds (queued for 1 second)
Status Job ID Name Coverage
  Main
passed #124760
tests-current

00:00:34

100.0%
 
  Compat
passed #124761
check-sdist

00:00:31

failed #124763
allowed to fail
tests-hg-default

00:00:34

99.0%
passed #124762
tests-hg-stable

00:00:29

100.0%
 
Name Stage Failure
failed
tests-hg-default Compat
FAIL Required test coverage of 100% not reached. Total coverage: 99.82%
=========================== short test summary info ============================
FAILED hgitaly/service/tests/test_commit.py::test_is_ancestor_obsolete - Type...
FAILED hgitaly/service/tests/test_repository_service.py::test_has_local_branches
FAILED hgitaly/tests/test_revision.py::test_gitlab_revision_changeset_by_hex
=================== 3 failed, 41 passed, 1 warning in 6.56s ====================
Running after_script
Uploading artifacts for failed job
ERROR: Job failed: exit code 1