New stable dev cycle

3 jobs for branch/default in 1 minute and 45 seconds (queued for 1 second)
Name Stage Failure
failed
tests-hg-stable Compat
FAILED hgitaly/tests/test_manifest.py::test_iter_dir_with_flat_paths_integration
FAILED hgitaly/tests/test_messages.py::test_tag - TypeError: cannot convert d...
FAILED hgitaly/tests/test_revision.py::test_gitlab_revision_changeset_by_hex
FAILED hgitaly/tests/test_revision.py::test_gitlab_revision_special_ref - Typ...
FAILED hgitaly/tests/test_revision.py::test_gitlab_revision_gl_branch - TypeE...
FAILED hgitaly/tests/test_servicer.py::test_load_repo_gc - TypeError: cannot ...
============ 56 failed, 37 passed, 14 skipped, 1 warning in 52.76s =============
Cleaning up file based variables
ERROR: Job failed: exit code 1