New development cycle

3 jobs for branch/default in 2 minutes and 7 seconds (queued for 1 second)
Name Stage Failure
failed
tests-hg-stable Compat
FAILED hgitaly/tests/test_manifest.py::test_iter_dir_with_flat_paths_integration
FAILED hgitaly/tests/test_messages.py::test_tag - TypeError: cannot convert d...
FAILED hgitaly/tests/test_revision.py::test_gitlab_revision_changeset_by_hex
FAILED hgitaly/tests/test_revision.py::test_gitlab_revision_special_ref - Typ...
FAILED hgitaly/tests/test_revision.py::test_gitlab_revision_gl_branch - TypeE...
FAILED hgitaly/tests/test_servicer.py::test_load_repo_gc - TypeError: cannot ...
======= 56 failed, 37 passed, 15 skipped, 1 warning in 64.10s (0:01:04) ========
Cleaning up file based variables
ERROR: Job failed: exit code 1
failed
tests-hg-default Compat
hgitaly/tag.py                                         4      0   100%
hgitaly/util.py 12 0 100%
----------------------------------------------------------------------
TOTAL 2851 1 99%

FAIL Required test coverage of 100% not reached. Total coverage: 99.96%
================== 93 passed, 15 skipped, 1 warning in 8.66s ===================
Cleaning up file based variables
ERROR: Job failed: exit code 1