Merged stable branch into stable

5 jobs for branch/default in 3 minutes and 18 seconds (queued for 3 seconds)
Name Stage Failure
failed
tests-hg-git-default Compat
FAILED hgext3rd/heptapod/tests/git/test_integration.py::test_ensure_gitlab_tags_file
FAILED hgext3rd/heptapod/tests/git/test_integration.py::test_ensure_gitlab_special_refs_file
FAILED hgext3rd/heptapod/tests/git/test_integration.py::test_ensure_gitlab_keep_arounds_file
FAILED hgext3rd/heptapod/tests/no_git/test_inner.py::test_never_prune_default_branch
FAILED hgext3rd/heptapod/tests/no_git/test_integration.py::test_share - Attri...
======================= 46 failed, 260 passed in 29.19s ========================
Cleaning up file based variables
nothing to do
ERROR: Job failed: exit code 1