rhg: try implement a `ui.warn()` replica [WIP]

15 jobs for topic/default/rust-status-fixes in 28 minutes and 13 seconds (queued for 7 seconds)
latest
Status Job ID Name Coverage
  Tests
manual check-pytype-py3 #210346
allowed to fail manual
failed checks-py2 #210333

00:04:27

failed checks-py3 #210334

00:03:44

failed rust-cargo-test-py2 #210335

00:01:57

failed rust-cargo-test-py3 #210336

00:02:01

passed test-py2 #210337

00:28:13

passed test-py2-chg #210344

00:25:38

passed test-py2-pure #210339

00:26:42

passed test-py2-rust #210341

00:21:55

passed test-py3 #210338

00:15:12

passed test-py3-chg #210345

00:10:41

passed test-py3-pure #210340

00:19:05

failed test-py3-rhg #210343

00:06:11

passed test-py3-rust #210342

00:25:24

 
  Phabricator
skipped phabricator-refresh #210347
 
Name Stage Failure
failed
test-py3-rhg Tests
error: aborting due to previous error

For more information about this error, try `rustc --explain E0106`.
error: could not compile `rhg`.

To learn more, run the command again with --verbose.
make: *** [Makefile:75: build-rhg] Error 101
Cleaning up file based variables
ERROR: Job failed: exit code 1
failed
checks-py2 Tests
  0.004  26.336  34.260  15.540  26.332   test-check-module-imports.t
0.005 28.100 51.130 16.140 28.095 test-check-config.t
0.026 34.416 285.510 19.720 34.390 test-check-format.t
0.007 43.201 315.430 20.570 43.194 test-check-pyflakes.t
0.000 53.479 352.640 21.620 53.478 test-check-code.t
0.017 94.094 426.080 23.540 94.077 test-check-pylint.t
0.020 108.885 845.130 45.770 108.865 test-check-cargo-lock.t
Cleaning up file based variables
ERROR: Job failed: exit code 1
failed
checks-py3 Tests
  0.008  12.801 253.040   7.990  12.793   test-check-help.t
0.006 13.656 266.180 8.210 13.650 test-check-config.t
0.004 14.427 280.120 8.470 14.422 test-check-module-imports.t
0.007 29.683 308.770 8.770 29.676 test-check-pyflakes.t
0.001 34.361 341.930 9.250 34.360 test-check-code.t
0.027 68.218 405.960 10.530 68.191 test-check-pylint.t
0.032 69.978 775.420 31.890 69.946 test-check-cargo-lock.t
Cleaning up file based variables
ERROR: Job failed: exit code 1
failed
rust-cargo-test-py3 Tests

error: aborting due to previous error

For more information about this error, try `rustc --explain E0106`.
error: could not compile `rhg`.
error: build failed
make: *** [Makefile:157: rust-tests] Error 101
Cleaning up file based variables
ERROR: Job failed: exit code 1
failed
rust-cargo-test-py2 Tests

error: aborting due to previous error

For more information about this error, try `rustc --explain E0106`.
error: could not compile `rhg`.
error: build failed
make: *** [Makefile:157: rust-tests] Error 101
Cleaning up file based variables
ERROR: Job failed: exit code 1