merge with stable

10 jobs for branch/default in 25 minutes and 31 seconds (queued for 3 seconds)
Status Job ID Name Coverage
  Test
failed #203277
allowed to fail
pytype-py3-hg-default

00:15:31

failed #203276
allowed to fail
pytype-py3-hg-stable

00:25:30

failed #203268
tests-py2-hg-5.6

00:07:13

passed #203269
tests-py2-hg-5.7

00:03:30

failed #203271
allowed to fail
tests-py2-hg-default

00:07:00

failed #203270
tests-py2-hg-stable

00:06:59

failed #203272
tests-py3-hg-5.6

00:05:05

passed #203273
tests-py3-hg-5.7

00:08:02

failed #203275
allowed to fail
tests-py3-hg-default

00:06:44

failed #203274
tests-py3-hg-stable

00:06:22

 
Name Stage Failure
failed
pytype-py3-hg-stable Test
[427/494] check tortoisehg.hgqt.postreview
[428/494] check tortoisehg.hgqt.phabreview
ninja: build stopped: cannot make progress due to previous errors.
Computing dependencies
Analyzing 128 sources with 218 local dependencies
Leaving directory '.pytype'
make: *** [Makefile:47: pytype] Error 1
Cleaning up file based variables
ERROR: Job failed: exit code 1
failed
pytype-py3-hg-default Test
[432/499] check tortoisehg.hgqt.postreview
[433/499] check tortoisehg.hgqt.phabreview
ninja: build stopped: cannot make progress due to previous errors.
Computing dependencies
Analyzing 128 sources with 221 local dependencies
Leaving directory '.pytype'
make: *** [Makefile:47: pytype] Error 1
Cleaning up file based variables
ERROR: Job failed: exit code 1
failed
tests-py2-hg-5.6 Test
creating locale/sr
creating locale/sr/LC_MESSAGES
generating locale/sr/LC_MESSAGES/tortoisehg.mo from i18n/tortoisehg/sr.po
HGRCPATH= python2 thg version
qt.qpa.screen: QXcbConnection: Could not connect to display
Could not connect to any X display.
make: *** [Makefile:26: local] Error 1
Cleaning up file based variables
ERROR: Job failed: exit code 1
failed
tests-py2-hg-default Test
        waitForUnbusy(a)
> self.assertTrue(a.isServiceRunning())
E AssertionError: False is not true

tests/qt_repomanager_test.py:218: AssertionError
====== 36 failed, 363 passed, 50 skipped, 2 deselected in 106.01 seconds =======
make: *** [Makefile:35: tests] Error 1
Cleaning up file based variables
ERROR: Job failed: exit code 1
failed
tests-py2-hg-stable Test
        waitForUnbusy(a)
> self.assertTrue(a.isServiceRunning())
E AssertionError: False is not true

tests/qt_repomanager_test.py:218: AssertionError
====== 36 failed, 363 passed, 50 skipped, 2 deselected in 106.68 seconds =======
make: *** [Makefile:35: tests] Error 1
Cleaning up file based variables
ERROR: Job failed: exit code 1
failed
tests-py3-hg-default Test
ERROR: test-inithook.t output changed
!..
Failed test-https.t: output changed
Failed test-inithook.t: output changed
# Ran 5 tests, 0 skipped, 2 failed.
python hash seed: 3248636135
make: *** [Makefile:37: tests] Error 1
Cleaning up file based variables
ERROR: Job failed: exit code 1
failed
tests-py3-hg-stable Test
ERROR: test-inithook.t output changed
!..
Failed test-https.t: output changed
Failed test-inithook.t: output changed
# Ran 5 tests, 0 skipped, 2 failed.
python hash seed: 2415982017
make: *** [Makefile:37: tests] Error 1
Cleaning up file based variables
ERROR: Job failed: exit code 1
failed
tests-py3-hg-5.6 Test
creating locale/ko
creating locale/ko/LC_MESSAGES
generating locale/ko/LC_MESSAGES/tortoisehg.mo from i18n/tortoisehg/ko.po
HGRCPATH= python3 thg version
qt.qpa.screen: QXcbConnection: Could not connect to display
Could not connect to any X display.
make: *** [Makefile:26: local] Error 1
Cleaning up file based variables
ERROR: Job failed: exit code 1