repowidget: update action availability on outgoingMode cleared (refs #5701)

Otherwise outgoing actions could be triggered by shortcut key.

--HG--
branch : stable
10 jobs for branch/stable in 24 minutes and 25 seconds (queued for 2 seconds)
Status Job ID Name Coverage
  Test
failed #205413
allowed to fail
pytype-py3-hg-default

00:24:23

failed #205412
allowed to fail
pytype-py3-hg-stable

00:15:22

failed #205404
tests-py2-hg-5.6

00:02:04

passed #205405
tests-py2-hg-5.7

00:07:44

failed #205407
allowed to fail
tests-py2-hg-default

00:09:21

failed #205406
tests-py2-hg-stable

00:08:34

failed #205408
tests-py3-hg-5.6

00:03:25

passed #205409
tests-py3-hg-5.7

00:07:23

failed #205411
allowed to fail
tests-py3-hg-default

00:04:57

failed #205410
tests-py3-hg-stable

00:07:39

 
Name Stage Failure
failed
pytype-py3-hg-default Test
[433/499] check tortoisehg.hgqt.phabreview
ninja: build stopped: cannot make progress due to previous errors.
Computing dependencies
Analyzing 128 sources with 221 local dependencies
Leaving directory '.pytype'
make: *** [Makefile:47: pytype] Error 1
Running after_script
Uploading artifacts for failed job
ERROR: Job failed: exit code 1
failed
pytype-py3-hg-stable Test
[427/494] check tortoisehg.hgqt.postreview
[428/494] check tortoisehg.hgqt.phabreview
ninja: build stopped: cannot make progress due to previous errors.
Computing dependencies
Analyzing 128 sources with 218 local dependencies
Leaving directory '.pytype'
make: *** [Makefile:47: pytype] Error 1
Cleaning up file based variables
ERROR: Job failed: exit code 1
failed
tests-py2-hg-default Test
        waitForUnbusy(a)
> self.assertTrue(a.isServiceRunning())
E AssertionError: False is not true

tests/qt_repomanager_test.py:218: AssertionError
====== 36 failed, 363 passed, 50 skipped, 2 deselected in 108.03 seconds =======
make: *** [Makefile:35: tests] Error 1
Cleaning up file based variables
ERROR: Job failed: exit code 1
failed
tests-py2-hg-stable Test
        waitForUnbusy(a)
> self.assertTrue(a.isServiceRunning())
E AssertionError: False is not true

tests/qt_repomanager_test.py:218: AssertionError
====== 36 failed, 363 passed, 50 skipped, 2 deselected in 107.26 seconds =======
make: *** [Makefile:35: tests] Error 1
Cleaning up file based variables
ERROR: Job failed: exit code 1
failed
tests-py3-hg-stable Test
ERROR: test-inithook.t output changed
!..
Failed test-https.t: output changed
Failed test-inithook.t: output changed
# Ran 5 tests, 0 skipped, 2 failed.
python hash seed: 684223440
make: *** [Makefile:37: tests] Error 1
Cleaning up file based variables
ERROR: Job failed: exit code 1
failed
tests-py3-hg-default Test
ERROR: test-inithook.t output changed
!..
Failed test-https.t: output changed
Failed test-inithook.t: output changed
# Ran 5 tests, 0 skipped, 2 failed.
python hash seed: 2195509420
make: *** [Makefile:37: tests] Error 1
Cleaning up file based variables
ERROR: Job failed: exit code 1
failed
tests-py3-hg-5.6 Test
creating locale/ja
creating locale/ja/LC_MESSAGES
generating locale/ja/LC_MESSAGES/tortoisehg.mo from i18n/tortoisehg/ja.po
HGRCPATH= python3 thg version
qt.qpa.screen: QXcbConnection: Could not connect to display
Could not connect to any X display.
make: *** [Makefile:26: local] Error 1
Cleaning up file based variables
ERROR: Job failed: exit code 1
failed
tests-py2-hg-5.6 Test
creating locale/pl/LC_MESSAGES
generating locale/pl/LC_MESSAGES/tortoisehg.mo from i18n/tortoisehg/pl.po
HGRCPATH= python2 thg version
qt.qpa.screen: QXcbConnection: Could not connect to display
Could not connect to any X display.
make: *** [Makefile:26: local] Error 1
Running after_script
Uploading artifacts for failed job
ERROR: Job failed: exit code 1