merge with stable

10 jobs for branch/default in 38 minutes and 11 seconds (queued for 6 minutes and 24 seconds)
Status Job ID Name Coverage
  Test
failed pytype-py3-hg-default #222984
allowed to fail

00:24:19

failed pytype-py3-hg-stable #222983
allowed to fail

00:24:25

failed tests-py2-hg-5.6 #222975

00:08:23

failed tests-py2-hg-5.7 #222976

00:06:12

failed tests-py2-hg-default #222978
allowed to fail

00:04:18

failed tests-py2-hg-stable #222977

00:06:24

failed tests-py3-hg-5.6 #222979

00:02:15

failed tests-py3-hg-5.7 #222980

00:04:01

passed tests-py3-hg-default #222982

00:09:10

passed tests-py3-hg-stable #222981

00:05:52

 
Name Stage Failure
failed
pytype-py3-hg-default Test
[437/504] check tortoisehg.hgqt.postreview
[438/504] check tortoisehg.hgqt.phabreview
ninja: build stopped: cannot make progress due to previous errors.
Computing dependencies
Analyzing 128 sources with 225 local dependencies
Leaving directory '.pytype'
make: *** [Makefile:47: pytype] Error 1
Cleaning up file based variables
ERROR: Job failed: exit code 1
failed
pytype-py3-hg-stable Test
[427/494] check tortoisehg.hgqt.postreview
[428/494] check tortoisehg.hgqt.phabreview
ninja: build stopped: cannot make progress due to previous errors.
Computing dependencies
Analyzing 128 sources with 218 local dependencies
Leaving directory '.pytype'
make: *** [Makefile:47: pytype] Error 1
Cleaning up file based variables
ERROR: Job failed: exit code 1
failed
tests-py3-hg-5.6 Test
  File "<frozen importlib._bootstrap_external>", line 728, in exec_module
File "<frozen importlib._bootstrap>", line 219, in _call_with_frames_removed
File "/builds/mercurial/tortoisehg/thg/tortoisehg/hgqt/run.py", line 30, in <module>
from mercurial.utils import (
ImportError: cannot import name 'urlutil' from 'mercurial.utils' (/ci/repos/mercurial/mercurial/utils/__init__.py)
make: *** [Makefile:26: local] Error 1
Running after_script
Uploading artifacts for failed job
ERROR: Job failed: exit code 1
failed
tests-py3-hg-5.7 Test
    self.__spec__.loader.exec_module(self)
File "<frozen importlib._bootstrap_external>", line 728, in exec_module
File "<frozen importlib._bootstrap>", line 219, in _call_with_frames_removed
File "/builds/mercurial/tortoisehg/thg/tortoisehg/hgqt/run.py", line 30, in <module>
from mercurial.utils import (
ImportError: cannot import name 'urlutil' from 'mercurial.utils' (/ci/repos/mercurial/mercurial/utils/__init__.py)
make: *** [Makefile:26: local] Error 1
Cleaning up file based variables
ERROR: Job failed: exit code 1
failed
tests-py2-hg-default Test
>       self.assertTrue(a.isServiceRunning())
E AssertionError: False is not true

tests/qt_repomanager_test.py:218: AssertionError
====== 36 failed, 363 passed, 50 skipped, 2 deselected in 106.45 seconds =======
make: *** [Makefile:35: tests] Error 1
Running after_script
Uploading artifacts for failed job
ERROR: Job failed: exit code 1
failed
tests-py2-hg-stable Test
        waitForUnbusy(a)
> self.assertTrue(a.isServiceRunning())
E AssertionError: False is not true

tests/qt_repomanager_test.py:218: AssertionError
====== 36 failed, 363 passed, 50 skipped, 2 deselected in 105.94 seconds =======
make: *** [Makefile:35: tests] Error 1
Cleaning up file based variables
ERROR: Job failed: exit code 1
failed
tests-py2-hg-5.7 Test
creating locale/fa
creating locale/fa/LC_MESSAGES
generating locale/fa/LC_MESSAGES/tortoisehg.mo from i18n/tortoisehg/fa.po
HGRCPATH= python2 thg version
qt.qpa.screen: QXcbConnection: Could not connect to display
Could not connect to any X display.
make: *** [Makefile:26: local] Error 1
Cleaning up file based variables
ERROR: Job failed: exit code 1
failed
tests-py2-hg-5.6 Test
creating locale/sr
creating locale/sr/LC_MESSAGES
generating locale/sr/LC_MESSAGES/tortoisehg.mo from i18n/tortoisehg/sr.po
HGRCPATH= python2 thg version
qt.qpa.screen: QXcbConnection: Could not connect to display
Could not connect to any X display.
make: *** [Makefile:26: local] Error 1
Cleaning up file based variables
ERROR: Job failed: exit code 1