merge default into stable (freeze for 5.5)

--HG--
branch : stable
10 jobs for 5.5rc0 in 20 minutes and 9 seconds (queued for 1 minute and 19 seconds)
latest
Status Job ID Name Coverage
  Test
failed #87727
allowed to fail
pytype-py3-hg-default

00:16:32

failed #87726
allowed to fail
pytype-py3-hg-stable

00:17:21

passed #87718
tests-py2-hg-5.3

00:01:44

passed #87719
tests-py2-hg-5.4

00:02:23

failed #87721
allowed to fail
tests-py2-hg-default

00:03:33

failed #87720
tests-py2-hg-stable

00:01:14

failed #87722
allowed to fail
tests-py3-hg-5.3

00:01:01

failed #87723
allowed to fail
tests-py3-hg-5.4

00:01:01

failed #87725
allowed to fail
tests-py3-hg-default

00:01:11

failed #87724
allowed to fail
tests-py3-hg-stable

00:01:11

 
Name Stage Failure
failed
pytype-py3-hg-stable Test
/usr/bin/python3 -m pytype.single --disable pyi-error --imports_info /builds/mercurial/tortoisehg/thg/.pytype/imports/tortoisehg.util.hglib.imports --module-name tortoisehg.util.hglib -V 3.7 -o /builds/mercurial/tortoisehg/thg/.pytype/pyi/tortoisehg/util/hglib.pyi --analyze-annotated --nofail --quick /builds/mercurial/tortoisehg/thg/tortoisehg/util/hglib.py
File "/builds/mercurial/tortoisehg/thg/tortoisehg/util/hglib.py", line 349, in <module>: No attribute 'mergestate' on module 'mercurial.merge' [module-attr]

For more details, see https://google.github.io/pytype/errors.html#module-attr.
ninja: build stopped: cannot make progress due to previous errors.
Computing dependencies
Analyzing 95 sources with 226 local dependencies
make: *** [Makefile:44: pytype] Error 1
ERROR: Job failed: exit code 1
failed
pytype-py3-hg-default Test

For more details, see https://google.github.io/pytype/errors.html#module-attr.
ninja: build stopped: cannot make progress due to previous errors.
Computing dependencies
Analyzing 95 sources with 227 local dependencies
make: *** [Makefile:44: pytype] Error 1
Running after_script
Uploading artifacts for failed job
ERROR: Job failed: exit code 1
failed
tests-py2-hg-default Test
creating locale/lv/LC_MESSAGES
generating locale/lv/LC_MESSAGES/tortoisehg.mo from i18n/tortoisehg/lv.po
HGRCPATH= python2 thg version
qt.qpa.screen: QXcbConnection: Could not connect to display
Could not connect to any X display.
make: *** [Makefile:26: local] Error 1
Running after_script
Uploading artifacts for failed job
ERROR: Job failed: exit code 1
failed
tests-py3-hg-default Test
creating locale/ru/LC_MESSAGES
generating locale/ru/LC_MESSAGES/tortoisehg.mo from i18n/tortoisehg/ru.po
HGRCPATH= python3 thg version
qt.qpa.screen: QXcbConnection: Could not connect to display
Could not connect to any X display.
make: *** [Makefile:26: local] Error 1
Running after_script
Uploading artifacts for failed job
ERROR: Job failed: exit code 1
failed
tests-py3-hg-stable Test
creating locale/ru/LC_MESSAGES
generating locale/ru/LC_MESSAGES/tortoisehg.mo from i18n/tortoisehg/ru.po
HGRCPATH= python3 thg version
qt.qpa.screen: QXcbConnection: Could not connect to display
Could not connect to any X display.
make: *** [Makefile:26: local] Error 1
Running after_script
Uploading artifacts for failed job
ERROR: Job failed: exit code 1
failed
tests-py3-hg-5.4 Test
ERROR tests/widget/repofilterbar_branch_test.py::RepoFilterBarBranchTest::test_selected_closed_branch_removed_from_list
ERROR tests/widget/repofilterbar_branch_test.py::RepoFilterBarBranchTest::test_selected_inactive_branch_removed_from_list
ERROR tests/widget/repofilterbar_branch_test.py::RepoFilterBarEmptyBranchTest::test_branch_combo_enabled_if_closed_branches_included
ERROR tests/widget/repofilterbar_branch_test.py::RepoFilterBarEmptyBranchTest::test_empty_branch_combo_is_disabled
= 82 failed, 60 passed, 50 skipped, 2 deselected, 97 warnings, 224 errors in 16.76s =
make: *** [Makefile:35: tests] Error 1
Running after_script
Uploading artifacts for failed job
ERROR: Job failed: exit code 1
failed
tests-py3-hg-5.3 Test
ERROR tests/widget/repofilterbar_branch_test.py::RepoFilterBarBranchTest::test_open_branches
ERROR tests/widget/repofilterbar_branch_test.py::RepoFilterBarBranchTest::test_selected_closed_branch_removed_from_list
ERROR tests/widget/repofilterbar_branch_test.py::RepoFilterBarBranchTest::test_selected_inactive_branch_removed_from_list
ERROR tests/widget/repofilterbar_branch_test.py::RepoFilterBarEmptyBranchTest::test_branch_combo_enabled_if_closed_branches_included
ERROR tests/widget/repofilterbar_branch_test.py::RepoFilterBarEmptyBranchTest::test_empty_branch_combo_is_disabled
= 82 failed, 60 passed, 50 skipped, 2 deselected, 97 warnings, 224 errors in 16.73s =
Running after_script
Uploading artifacts for failed job
ERROR: Job failed: exit code 1
failed
tests-py2-hg-stable Test
creating locale/ru/LC_MESSAGES
generating locale/ru/LC_MESSAGES/tortoisehg.mo from i18n/tortoisehg/ru.po
HGRCPATH= python2 thg version
qt.qpa.screen: QXcbConnection: Could not connect to display
Could not connect to any X display.
make: *** [Makefile:26: local] Error 1
Running after_script
Uploading artifacts for failed job
ERROR: Job failed: exit code 1