Read about our upcoming Code of Conduct on this issue

style: use f-strings

--HG--
branch : 3.1
6 jobs for topic/3.1/workbook-customDocProps in 2 minutes and 35 seconds (queued for 2 seconds)
Status Name Job ID Coverage
  Test
passed test-coverage #203490

00:01:26

95.0%
failed test-pypy3 #203489

00:02:20

passed test-python36 #203485

00:00:59

failed test-python37 #203486

00:02:35

passed test-python38 #203487

00:01:01

passed test-python39 #203488

00:01:01

 
Name Stage Failure
failed
test-python37 Test
  py37-keep_vba: commands succeeded
nopillow: commands succeeded
xfail: commands succeeded
pandas: commands succeeded
numpy: commands succeeded
doc: commands succeeded
ERROR: doctest: parallel child exit code 1
Cleaning up file based variables
ERROR: Job failed: exit code 1
failed
test-pypy3 Test
=========================== short test summary info ============================
FAILED openpyxl/packaging/tests/test_custom.py::TestCustomDocumentProperties::test_ctor
FAILED openpyxl/packaging/tests/test_custom.py::TestCustomDocumentProperties::test_from_xml
FAILED openpyxl/tests/test_read_write_custom_doc_props.py::test_write_custom_doc_props
ERROR: InvocationError for command /builds/openpyxl/openpyxl/.tox/pypy3/bin/pytest -qqrf (exited with code 1)
___________________________________ summary ____________________________________
ERROR: pypy3: commands failed
Cleaning up file based variables
ERROR: Job failed: exit code 1